{"text_format":"1","workbook":"xlsx","n_sheets":5,"sheets":["Intro","TABLES-FORMS","COLUMN","Data","Param"],"not_rendered":{"charts":0,"images":0,"macros":1,"external_links":0,"defined_names":24,"comments":2,"pivot_tables":0},"unopened":[],"bounds":{"document_bytes":16777216,"sheet_cells":100000,"rows_first":2000,"rows_last":500,"rows_between":2000,"halvings":0,"cell_chars":16384,"cell_head_chars":4096},"cells_cut":0,"cells_raw":0,"read":"whole","date_system":"1900"}

{"sheet":"Intro","index":0,"n_rows":48,"n_cols":3,"rows_kept":48,"cut":false,"hidden":false,"merged":[[1,1,1,14],[2,1,2,14],[3,1,3,14]]}
[]
[null,"IEA Oil Annual Mini Questionnaire"]
[null,{"$f":"DataYear+1&\" provisional data\"","v":"1 provisional data"}]
[null,{"$f":"CountryName","v":"Country"}]
[]
[null,"This questionnaire is operational if VBA macros are operational, so please enable execution of VBA macros. "]
[null,"Please enter new data as values (up to three decimal places) or enter a formula but with no links to external file sources."]
[]
[null,"This is the second cycle collecting provisional oil supply and demand data. Feedback on the IEA oil mini-questionnaire would be welcome. "]
[]
[null,"The IEA has historically estimated provisional oil supply data for Y-1 based mainly on the Monthly Oil Statistics (MOS) and national preliminary balance, where available. "]
[null,"As mentioned in the ESDG in October 2020, the IEA aims to expand this data collection into supply and demand to enhance the data quality. "]
[null,"In particular, oil demand data for the provisional year would be very useful in deriving key energy indicators such as fuel shares in final consumption, efficiency and emissions,"]
[null,"which are increasingly requested by various stakeholders. "]
[]
[null,"To further enhance our coverage and meet the needs of various stakeholders, changes to this cycle's IEA oil mini-questionnaires include request for data on:"]
[null,null,"● Non-energy use in the Industry sector"]
[null,null,"● Energy use in International aviation"]
[]
[null,"In the previous cycle for oil, a biofuels survey was sent out along with the IEA oil mini-questionnaire. This cycle, we no longer send out the biofuels survey. "]
[null,"At a minimum, please submit blended/intended for blending biofuels data in the IEA oil mini-questionnaire."]
[null,"Please enter them in the cells with blue background and orange borders. The flows collected for biofuels are similar to those collected in the past in the biofuels survey. "]
[]
[null,"Should you be able to provide provisional supply and demand oil data for Y-1, please fill the data in the oil mini-questionnaire. "]
[null,"Partial data are very much welcome. This could be interpreted as ‘only some flows being included’ or as ‘partial coverage of any of the flows,’ either of which is acceptable."]
[null,"However, we request that a remark/note be added when we have the second case (so we know from the start we are looking at partial information)."]
[null,"The remark/note may be added in the \"Explanatory remarks\" column in the \"Column\" tab."]
[]
[null,"In the oil mini-questionnaire, you may opt to fill the data in either the \"Tables-Forms\" sheet or the \"Column\" sheet. "]
[null,"The entries in one sheet will be automatically updated in the other sheet once filled (a VBA macro runs when toggling between views and you may notice a slight delay). "]
[null,"We highly encourage you to take advantage of the Check column available in the \"Column\" tab to ensure data consistency. "]
[null,"You may also enter remarks in the \"Column\" tab to confirm or explain any large y-o-y changes in the data (whose % variation will be marked in red if greater or less than 20%). "]
[]
[null,"All definitions and instructions for the annual oil questionnaire apply."]
[null,null,"Annual oil questionnaire instructions"]
[null,"The flow \"of which input to electricity and heat generation\" refers to the sum of oil inputs for main activity and autoproducers for electricity, heat and CHP production. "]
[null,"Other oil products in the IEA oil mini-questionnaire also include White spirit, Lubricants, Bitumen and Paraffin waxes."]
[]
[null,"Notes:"]
[null,123,"- Cells with white background cannot be edited."]
{"$rows_left_out":9}
{"sheet":"TABLES-FORMS","index":1,"n_rows":49,"n_cols":29,"rows_kept":49,"cut":false,"hidden":false,"merged":[]}
[null,"SUPPLY\nCRUDE OIL, NGL, REFINERY FEEDSTOCKS, ADDITIVES AND OTHER HYDROCARBONS"]
[null,"unit: kt (thousand tons)"]
[null,{"$f":"COLUMN!H1","v":"2021E"},"Crude Oil","Natural gas\nliquids","Refinery\nfeedstocks","Additives / oxygenates","Of which\nBiofuels","Other\nhydrocarbons","TOTAL","Growth rates\nto previous\nyear"]
["+","Indigenous production",null,null,null,null,null,null,{"$f":"SUM(C4:F4,H4)","v":0},{"$f":"IF(I4=0,0,IF(Data!H4=0,0,((I4/Data!H4)-1)))","v":0}]
["+","From Other Sources",null,null,null,null,null,null,{"$f":"SUM(C5:F5,H5)","v":0},{"$f":"IF(I5=0,0,IF(Data!H5=0,0,((I5/Data!H5)-1)))","v":0}]
[null,"From Other Sources: Coal",null,null,null,null,null,null,0,{"$f":"IF(I6=0,0,IF(Data!H6=0,0,((I6/Data!H6)-1)))","v":0}]
[null,"From Other Sources: Natural gas",null,null,null,null,null,null,0,{"$f":"IF(I7=0,0,IF(Data!H7=0,0,((I7/Data!H7)-1)))","v":0}]
[null,"From Other Sources: Renewables",null,null,null,null,null,null,0,{"$f":"IF(I8=0,0,IF(Data!H8=0,0,((I8/Data!H8)-1)))","v":0}]
["+","Backflows to Refineries",null,null,null,null,null,null,0,{"$f":"IF(I9=0,0,IF(Data!H9=0,0,((I9/Data!H9)-1)))","v":0}]
["+","Products transferred",null,null,null,null,null,null,0,{"$f":"IF(I10=0,0,IF(Data!H10=0,0,((I10/Data!H10)-1)))","v":0}]
["+","Total Imports (Balance)",null,null,null,null,null,null,0,{"$f":"IF(I11=0,0,IF(Data!H11=0,0,((I11/Data!H11)-1)))","v":0}]
["-","Total Exports (Balance)",null,null,null,null,null,null,0,{"$f":"IF(I12=0,0,IF(Data!H12=0,0,((I12/Data!H12)-1)))","v":0}]
["-","Direct use",null,null,null,null,null,null,0,{"$f":"IF(I13=0,0,IF(Data!H13=0,0,((I13/Data!H13)-1)))","v":0}]
["+","Stock changes (National territory)",null,null,null,null,null,null,0,{"$f":"IF(I14=0,0,IF(Data!H14=0,0,((I14/Data!H14)-1)))","v":0}]
["=","Refinery intake (Calculated)",{"$f":"C4+C5+C9+C10+C11-C12-C13+C14","v":0},0,0,0,0,0,0,{"$f":"IF(I15=0,0,IF(Data!H15=0,0,((I15/Data!H15)-1)))","v":0}]
[null,"Statistical difference",{"$f":"C15-C17","v":0},0,0,0,0,0,{"$f":"SUM(C16:F16,H16)","v":0},{"$f":"IF(I16=0,0,IF(Data!H16=0,0,((I16/Data!H16)-1)))","v":0}]
[null,"Refinery intake (Observed)",null,null,null,null,null,null,0,{"$f":"IF(I17=0,0,IF(Data!H17=0,0,((I17/Data!H17)-1)))","v":0}]
[null,"Refinery losses",null,null,null,null,null,null,0,{"$f":"IF(I18=0,0,IF(Data!H18=0,0,((I18/Data!H18)-1)))","v":0}]
[]
[null,"SUPPLY, DELIVERIES & CONSUMPTION"]
[null,"unit: kt (thousand tons)"]
[null,{"$f":"COLUMN!H1","v":"2021E"},"Crude\noil","Natural\ngas\nliquids","Refinery\ngas","Ethane","LPG","Naphtha","Total motor\ngasoline","Biogasoline","Non-biogasoline","Aviation\ngasoline","Gasoline\ntype\njet fuel","Total kerosene\ntype\njet fuel","Bio jet kerosene","Non-bio jet kerosene","Other\nkerosene","Road Diesel","Heating and other gasoil","Total gas/diesel\noil","Biodiesels ","Non-bio gas/diesel oil","Total fuel oil","Low Sulphur fuel oil","High Sulphur fuel oil","Petroleum\ncoke","Other oil\nproducts","TOTAL","Growth rates\nto previous\nyear"]
["+","Primary product receipts",null,null,null,null,null,null,{"$f":"J23+K23","v":0},null,null,null,null,{"$f":"O23+P23","v":0},null,null,null,null,null,{"$f":"U23+V23","v":0},null,null,{"$f":"X23+Y23","v":0},null,null,null,null,{"$f":"SUM(C23:I23,L23:N23,Q23,T23,W23,Z23,AA23)","v":0},{"$f":"IF(AB23=0,0,IF(Data!AF19=0,0,((AB23/Data!AF19)-1)))","v":0}]
["+","Refinery gross output",null,null,null,null,null,null,{"$f":"J24+K24","v":0},null,null,null,null,{"$f":"O24+P24","v":0},null,null,null,null,null,{"$f":"U24+V24","v":0},null,null,{"$f":"X24+Y24","v":0},null,null,null,null,0,{"$f":"IF(AB24=0,0,IF(Data!AF20=0,0,((AB24/Data!AF20)-1)))","v":0}]
["+","Recycled products",null,null,null,null,null,null,0,null,null,null,null,0,null,null,null,null,null,0,null,null,0,null,null,null,null,0,{"$f":"IF(AB25=0,0,IF(Data!AF21=0,0,((AB25/Data!AF21)-1)))","v":0}]
["-","Refinery fuel",null,null,null,null,null,null,0,null,null,null,null,0,null,null,null,null,null,0,null,null,0,null,null,null,null,0,{"$f":"IF(AB26=0,0,IF(Data!AF22=0,0,((AB26/Data!AF22)-1)))","v":0}]
["+","Total Imports (Balance)",null,null,null,null,null,null,0,null,null,null,null,0,null,null,null,null,null,0,null,null,0,null,null,null,null,0,{"$f":"IF(AB27=0,0,IF(Data!AF11=0,0,((AB27/Data!AF11)-1)))","v":0}]
["-","Total Exports (Balance)",null,null,null,null,null,null,0,null,null,null,null,0,null,null,null,null,null,0,null,null,0,null,null,null,null,0,{"$f":"IF(AB28=0,0,IF(Data!AF12=0,0,((AB28/Data!AF12)-1)))","v":0}]
["-","International marine bunkers",null,null,null,null,null,null,0,null,null,null,null,0,null,null,null,null,null,0,null,null,0,null,null,null,null,0,{"$f":"IF(AB29=0,0,IF(Data!AF23=0,0,((AB29/Data!AF23)-1)))","v":0}]
["+","Interproduct transfers",null,null,null,null,null,null,0,null,null,null,null,0,null,null,null,null,null,0,null,null,0,null,null,null,null,0,{"$f":"IF(AB30=0,0,IF(Data!AF24=0,0,((AB30/Data!AF24)-1)))","v":0}]
["-","Products transferred",null,null,null,null,null,null,0,null,null,null,null,0,null,null,null,null,null,0,null,null,0,null,null,null,null,0,{"$f":"IF(AB31=0,0,IF(Data!AF10=0,0,((AB31/Data!AF10)-1)))","v":0}]
["+","Stock changes (National territory)",null,null,null,null,null,null,0,null,null,null,null,0,null,null,null,null,null,0,null,null,0,null,null,null,null,0,{"$f":"IF(AB32=0,0,IF(Data!AF14=0,0,((AB32/Data!AF14)-1)))","v":0}]
["=","Gross inland deliveries (Calculated)",{"$f":"C23+C24+C25-C26+C27-C28-C29+C30-C31+C32","v":0},0,0,0,0,0,{"$f":"I23+I24+I25-I26+I27-I28-I29+I30-I31+I32","v":0},{"$f":"J23+J24+J25-J26+J27-J28-J29+J30-J31+J32","v":0},{"$f":"K23+K24+K25-K26+K27-K28-K29+K30-K31+K32","v":0},{"$f":"L23+L24+L25-L26+L27-L28-L29+L30-L31+L32","v":0},{"$f":"M23+M24+M25-M26+M27-M28-M29+M30-M31+M32","v":0},0,{"$f":"O23+O24+O25-O26+O27-O28-O29+O30-O31+O32","v":0},{"$f":"P23+P24+P25-P26+P27-P28-P29+P30-P31+P32","v":0},{"$f":"Q23+Q24+Q25-Q26+Q27-Q28-Q29+Q30-Q31+Q32","v":0},{"$f":"R23+R24+R25-R26+R27-R28-R29+R30-R31+R32","v":0},0,0,{"$f":"U23+U24+U25-U26+U27-U28-U29+U30-U31+U32","v":0},{"$f":"V23+V24+V25-V26+V27-V28-V29+V30-V31+V32","v":0},0,{"$f":"X23+X24+X25-X26+X27-X28-X29+X30-X31+X32","v":0},{"$f":"Y23+Y24+Y25-Y26+Y27-Y28-Y29+Y30-Y31+Y32","v":0},{"$f":"Z23+Z24+Z25-Z26+Z27-Z28-Z29+Z30-Z31+Z32","v":0},{"$f":"AA23+AA24+AA25-AA26+AA27-AA28-AA29+AA30-AA31+AA32","v":0},0,{"$f":"IF(AB33=0,0,IF(Data!AF25=0,0,((AB33/Data!AF25)-1)))","v":0}]
[null,"Statistical difference",{"$f":"C33-C35","v":0},0,0,0,0,0,{"$f":"I33-I35","v":0},{"$f":"J33-J35","v":0},{"$f":"K33-K35","v":0},{"$f":"L33-L35","v":0},{"$f":"M33-M35","v":0},0,{"$f":"O33-O35","v":0},{"$f":"P33-P35","v":0},{"$f":"Q33-Q35","v":0},{"$f":"R33-R35","v":0},0,0,{"$f":"U33-U35","v":0},{"$f":"V33-V35","v":0},0,{"$f":"X33-X35","v":0},{"$f":"Y33-Y35","v":0},{"$f":"Z33-Z35","v":0},{"$f":"AA33-AA35","v":0},{"$f":"ROUND(SUM(C34:I34,L34:N34,Q34,T34,W34,Z34,AA34),3)","v":0},{"$f":"IF(AB34=0,0,IF(Data!AF16=0,0,((AB34/Data!AF16)-1)))","v":0}]
[null,"Gross inland deliveries (Observed)",null,null,null,null,null,null,{"$f":"J35+K35","v":0},null,null,null,null,{"$f":"O35+P35","v":0},null,null,null,null,null,{"$f":"U35+V35","v":0},null,null,{"$f":"X35+Y35","v":0},null,null,null,null,{"$f":"SUM(C35:I35,L35:N35,Q35,T35,W35,Z35,AA35)","v":0},{"$f":"IF(AB35=0,0,IF(Data!AF26=0,0,((AB35/Data!AF26)-1)))","v":0}]
[null,"Transformation sector",null,null,null,null,null,null,{"$f":"J36+K36","v":0},null,null,null,null,{"$f":"O36+P36","v":0},null,null,null,null,null,{"$f":"U36+V36","v":0},null,null,{"$f":"X36+Y36","v":0},null,null,null,null,0,{"$f":"IF(AB36=0,0,IF(Data!AF28=0,0,((AB36/Data!AF28)-1)))","v":0}]
[null,"of which input to electricity and heat generation",null,null,null,null,null,null,{"$f":"J37+K37","v":0},null,null,null,null,{"$f":"O37+P37","v":0},null,null,null,null,null,{"$f":"U37+V37","v":0},null,null,{"$f":"X37+Y37","v":0},null,null,null,null,0]
[null,"Energy sector",null,null,null,null,null,null,0,null,null,null,null,0,null,null,null,null,null,0,null,null,0,null,null,null,null,0,{"$f":"IF(AB38=0,0,IF(Data!AF29=0,0,((AB38/Data!AF29)-1)))","v":0}]
[null,"Distribution losses",null,null,null,null,null,null,0,null,null,null,null,0,null,null,null,null,null,0,null,null,0,null,null,null,null,0,{"$f":"IF(AB39=0,0,IF(Data!AF30=0,0,((AB39/Data!AF30)-1)))","v":0}]
[null,"Total final consumption",null,null,null,null,null,null,0,null,null,null,null,0,null,null,null,null,null,0,null,null,0,null,null,null,null,0,{"$f":"IF(AB40=0,0,IF(Data!AF31=0,0,((AB40/Data!AF31)-1)))","v":0}]
{"$rows_left_out":10}
{"sheet":"COLUMN","index":2,"n_rows":808,"n_cols":11,"rows_kept":808,"cut":false,"hidden":false,"merged":[]}
[null,"unit: kt",null,null,null,null,"2020 prefilled from annual data","2021E","Variation (%)","Checks","Explanatory remarks"]
[null,"Crude oil","Indigenous production","BALANCE","CRUDEOIL","INDPROD",{"$f":"OFFSET(Data!$A$3,MATCH($F2,Data!$A$4:$A$40,0),MATCH($E2,Data!$B$3:$AF$3,0))","v":{"$error":"#N/A"}},null,{"$f":"IF(H2=0,0,IF(G2=0,0,((H2/G2)-1)*100))","v":0}]
[null,"Crude oil","From Other Sources","BALANCE","CRUDEOIL","OSOURCES"]
[null,"Crude oil","From Other Sources: Coal","BALANCE","CRUDEOIL","OSCOAL"]
[null,"Crude oil","From Other Sources: Natural gas","BALANCE","CRUDEOIL","OSNATGAS"]
[null,"Crude oil","From Other Sources: Renewables","BALANCE","CRUDEOIL","OSRENEW"]
[null,"Crude oil","Backflows to Refineries","BALANCE","CRUDEOIL","BACKFLOW"]
[null,"Crude oil","Products transferred","BALANCE","CRUDEOIL","PTRANSF"]
[null,"Crude oil","Total Imports (Balance)","BALANCE","CRUDEOIL","TOTIMPSB",{"$f":"OFFSET(Data!$A$3,MATCH($F9,Data!$A$4:$A$40,0),MATCH($E9,Data!$B$3:$AF$3,0))","v":{"$error":"#N/A"}},null,{"$f":"IF(H9=0,0,IF(G9=0,0,((H9/G9)-1)*100))","v":0}]
[null,"Crude oil","Total Exports (Balance)","BALANCE","CRUDEOIL","TOTEXPSB",{"$f":"OFFSET(Data!$A$3,MATCH($F10,Data!$A$4:$A$40,0),MATCH($E10,Data!$B$3:$AF$3,0))","v":{"$error":"#N/A"}},null,0]
[null,"Crude oil","Direct use","BALANCE","CRUDEOIL","DIRECUSE",{"$f":"OFFSET(Data!$A$3,MATCH($F11,Data!$A$4:$A$40,0),MATCH($E11,Data!$B$3:$AF$3,0))","v":{"$error":"#N/A"}},null,0,"  "]
[null,"Crude oil","Stock Changes (National Territory)","BALANCE","CRUDEOIL","STCHANAT",{"$f":"OFFSET(Data!$A$3,MATCH($F12,Data!$A$4:$A$40,0),MATCH($E12,Data!$B$3:$AF$3,0))","v":{"$error":"#N/A"}},null,0]
[null,"Crude oil","Refinery intake (Calculated)","BALANCE","CRUDEOIL","REFINCAL",{"$f":"OFFSET(Data!$A$3,MATCH($F13,Data!$A$4:$A$40,0),MATCH($E13,Data!$B$3:$AF$3,0))","v":{"$error":"#N/A"}},{"$f":"H2+H3+H7+H8+H9-H10-H11+H12","v":0},0]
[null,"Crude oil","Statistical Differences","BALANCE","CRUDEOIL","STATDIFF",{"$f":"OFFSET(Data!$A$3,MATCH($F14,Data!$A$4:$A$40,0),MATCH($E14,Data!$B$3:$AF$3,0))","v":{"$error":"#N/A"}},{"$f":"H13-H15","v":0},0]
[null,"Crude oil","Refinery intake (Observed)","BALANCE","CRUDEOIL","REFINOBS",{"$f":"OFFSET(Data!$A$3,MATCH($F15,Data!$A$4:$A$40,0),MATCH($E15,Data!$B$3:$AF$3,0))","v":{"$error":"#N/A"}},null,0]
[null,"Crude oil","Refinery losses","BALANCE","CRUDEOIL","REFLOSS",{"$f":"OFFSET(Data!$A$3,MATCH($F16,Data!$A$4:$A$40,0),MATCH($E16,Data!$B$3:$AF$3,0))","v":{"$error":"#N/A"}},null,0]
[null,"Natural gas liquids","Indigenous production","BALANCE","NGL","INDPROD",{"$f":"OFFSET(Data!$A$3,MATCH($F17,Data!$A$4:$A$40,0),MATCH($E17,Data!$B$3:$AF$3,0))","v":{"$error":"#N/A"}},null,0]
[null,"Natural gas liquids","From Other Sources","BALANCE","NGL","OSOURCES"]
[null,"Natural gas liquids","From Other Sources: Coal","BALANCE","NGL","OSCOAL"]
[null,"Natural gas liquids","From Other Sources: Natural gas","BALANCE","NGL","OSNATGAS"]
[null,"Natural gas liquids","From Other Sources: Renewables","BALANCE","NGL","OSRENEW"]
[null,"Natural gas liquids","Backflows to Refineries","BALANCE","NGL","BACKFLOW"]
[null,"Natural gas liquids","Products transferred","BALANCE","NGL","PTRANSF"]
[null,"Natural gas liquids","Total Imports (Balance)","BALANCE","NGL","TOTIMPSB",{"$f":"OFFSET(Data!$A$3,MATCH($F24,Data!$A$4:$A$40,0),MATCH($E24,Data!$B$3:$AF$3,0))","v":{"$error":"#N/A"}},null,0]
[null,"Natural gas liquids","Total Exports (Balance)","BALANCE","NGL","TOTEXPSB",{"$f":"OFFSET(Data!$A$3,MATCH($F25,Data!$A$4:$A$40,0),MATCH($E25,Data!$B$3:$AF$3,0))","v":{"$error":"#N/A"}},null,0]
[null,"Natural gas liquids","Direct use","BALANCE","NGL","DIRECUSE",{"$f":"OFFSET(Data!$A$3,MATCH($F26,Data!$A$4:$A$40,0),MATCH($E26,Data!$B$3:$AF$3,0))","v":{"$error":"#N/A"}},null,0]
[null,"Natural gas liquids","Stock Changes (National Territory)","BALANCE","NGL","STCHANAT",{"$f":"OFFSET(Data!$A$3,MATCH($F27,Data!$A$4:$A$40,0),MATCH($E27,Data!$B$3:$AF$3,0))","v":{"$error":"#N/A"}},null,0]
[null,"Natural gas liquids","Refinery intake (Calculated)","BALANCE","NGL","REFINCAL",{"$f":"OFFSET(Data!$A$3,MATCH($F28,Data!$A$4:$A$40,0),MATCH($E28,Data!$B$3:$AF$3,0))","v":{"$error":"#N/A"}},{"$f":"H17+H18+H22+H23+H24-H25-H26+H27","v":0},0]
[null,"Natural gas liquids","Statistical Differences","BALANCE","NGL","STATDIFF",{"$f":"OFFSET(Data!$A$3,MATCH($F29,Data!$A$4:$A$40,0),MATCH($E29,Data!$B$3:$AF$3,0))","v":{"$error":"#N/A"}},{"$f":"H28-H30","v":0},0]
[null,"Natural gas liquids","Refinery intake (Observed)","BALANCE","NGL","REFINOBS",{"$f":"OFFSET(Data!$A$3,MATCH($F30,Data!$A$4:$A$40,0),MATCH($E30,Data!$B$3:$AF$3,0))","v":{"$error":"#N/A"}},null,0]
[null,"Natural gas liquids","Refinery losses","BALANCE","NGL","REFLOSS",{"$f":"OFFSET(Data!$A$3,MATCH($F31,Data!$A$4:$A$40,0),MATCH($E31,Data!$B$3:$AF$3,0))","v":{"$error":"#N/A"}},null,0]
[null,"Refinery feedstocks","Indigenous production","BALANCE","REFFEEDS","INDPROD"]
[null,"Refinery feedstocks","From Other Sources","BALANCE","REFFEEDS","OSOURCES"]
[null,"Refinery feedstocks","From Other Sources: Coal","BALANCE","REFFEEDS","OSCOAL"]
[null,"Refinery feedstocks","From Other Sources: Natural gas","BALANCE","REFFEEDS","OSNATGAS"]
[null,"Refinery feedstocks","From Other Sources: Renewables","BALANCE","REFFEEDS","OSRENEW"]
[null,"Refinery feedstocks","Backflows to Refineries","BALANCE","REFFEEDS","BACKFLOW",{"$f":"OFFSET(Data!$A$3,MATCH($F37,Data!$A$4:$A$40,0),MATCH($E37,Data!$B$3:$AF$3,0))","v":{"$error":"#N/A"}},null,0]
[null,"Refinery feedstocks","Products transferred","BALANCE","REFFEEDS","PTRANSF",{"$f":"OFFSET(Data!$A$3,MATCH($F38,Data!$A$4:$A$40,0),MATCH($E38,Data!$B$3:$AF$3,0))","v":{"$error":"#N/A"}},null,0,{"$f":"IF(H38=H790,\"\",\"Refinery feedstocks - Products transferred should equal Total products - Products transferred.\")","v":""}]
[null,"Refinery feedstocks","Total Imports (Balance)","BALANCE","REFFEEDS","TOTIMPSB",{"$f":"OFFSET(Data!$A$3,MATCH($F39,Data!$A$4:$A$40,0),MATCH($E39,Data!$B$3:$AF$3,0))","v":{"$error":"#N/A"}},null,0]
[null,"Refinery feedstocks","Total Exports (Balance)","BALANCE","REFFEEDS","TOTEXPSB",{"$f":"OFFSET(Data!$A$3,MATCH($F40,Data!$A$4:$A$40,0),MATCH($E40,Data!$B$3:$AF$3,0))","v":{"$error":"#N/A"}},null,0]
{"$rows_left_out":769}
{"sheet":"Data","index":3,"n_rows":0,"n_cols":0,"rows_kept":0,"cut":false,"hidden":false,"merged":[]}

{"sheet":"Param","index":4,"n_rows":91,"n_cols":11,"rows_kept":91,"cut":false,"hidden":true,"merged":[]}
[]
[null,"SETTINGS"]
[]
[]
[null,null,"ParamCountry / CountryList"]
[null,null,"Country","COUNTRY","00"]
[null,null,"Australia","AUSTRALI","AU"]
[null,null,"Austria","AUSTRIA","AT"]
[null,null,"Belgium","BELGIUM","BE"]
[null,null,"Canada","CANADA","CA"]
[null,null,"Chile","CHILE","CL"]
[null,null,"Colombia","COLOMBIA","CO"]
[null,null,"Costa Rica","COSTARICA","CR"]
[null,null,"Czech Republic","CZECH","CZ"]
[null,null,"Denmark","DENMARK","DK"]
[null,null,"Estonia","ESTONIA","EE"]
[null,null,"Finland","FINLAND","FI"]
[null,null,"France","FRANCE","FR"]
[null,null,"Germany","GERMANY","DE"]
[null,null,"Greece","GREECE","GR"]
[null,null,"Hungary","HUNGARY","HU"]
[null,null,"Iceland","ICELAND","IS"]
[null,null,"Ireland","IRELAND","IE"]
[null,null,"Israel","ISRAEL","IL"]
[null,null,"Italy","ITALY","IT"]
[null,null,"Japan","JAPAN","JP"]
[null,null,"Korea","KOREA","KR"]
[null,null,"Latvia","LATVIA","LV"]
[null,null,"Luxembourg","LUXEMBOU","LU"]
[null,null,"Mexico","MEXICO","MX"]
[null,null,"Netherlands","NETHLAND","NL"]
[null,null,"New Zealand","NZ","NZ"]
[null,null,"Norway","NORWAY","NO"]
[null,null,"Poland","POLAND","PL"]
[null,null,"Portugal","PORTUGAL","PT"]
[null,null,"Russian Federation","RUSSIA","RU"]
[null,null,"Slovak Republic","SLOVAKIA","SK"]
[null,null,"Slovenia","SLOVENIA","SI"]
[null,null,"Spain","SPAIN","ES"]
[null,null,"Sweden","SWEDEN","SE"]
{"$rows_left_out":51}